{"text_format":"3","workbook":"xlsx","n_sheets":2,"sheets":["人员信息汇总表","岗位序列"],"not_rendered":{"defined_names":10},"read":"whole","date_system":"1900"}

{"sheet":"人员信息汇总表","index":0,"n_rows":6,"n_cols":25,"rows_kept":6,"merged":[[0,1,0,24],[1,0,2,0],[1,1,2,1],[1,2,2,2],[1,3,2,3],[1,4,2,4],[1,5,2,5],[1,6,2,6],[1,7,2,7],[1,8,2,8],[1,9,2,9],[1,10,2,10],[1,11,2,11],[1,12,2,12],[1,13,2,13],[1,14,2,14],[1,15,2,15],[1,16,2,16],[1,17,2,17],[1,18,2,18],[1,19,2,19],[1,20,2,20],[1,21,1,22],[1,23,2,23],[1,24,2,24],[5,0,5,24]]}
[null,"国家电网有限公司大数据中心2019年社会招聘人员信息汇总表（样表）"]
["姓名","应聘\n岗位\n编号","应聘部门","应聘处室","应聘岗位","性别","籍贯","出生年月","参加工作\n时间","政治\n面貌","全日制\n学历\n学位","全日制\n院校专业","最高\n学历\n学位","最高学历学位院校专业","本专业领域/岗位工作年限","现工作单位及职务","现职务\n时间","职务\n级别","专业技术资格\n（技能等级）","是否服从调剂","身份证号","联系方式",null,"通讯地址","备注\n（特殊资质、特殊业绩、获奖等情况）"]
[{"$nulls":21},"手机号码","电子邮件"]
["示例：张三","0212",{"$f":"VLOOKUP(B4,岗位序列!$A$3:$D$52,2,FALSE)","v":"数据分析中心"},{"$f":"VLOOKUP(B4,岗位序列!$A$3:$D$52,3,FALSE)","v":"电网处"},{"$f":"VLOOKUP(B4,岗位序列!$A$3:$D$52,4,FALSE)","v":"算法模型工程师"},"男","河北\n遵化",1986.03,2011.07,"中共\n党员","研究生\n硕士","xx大学\nxx专业","研究生\n硕士","（最高学历）xx大学xx专业\n（最高学位）xx大学xx专业","xx年","xx公司\nxx部xx岗",2017.08,"正科","经济师","是","130280xxxxxxxxxxxx","138xxxxxxxx","xx@xx.xx","xx省xx市xx区xx（具体到门牌号）"]
[null,"请在下拉列表中选择应聘岗位编号",{"$f":"VLOOKUP(B5,岗位序列!$A$3:$D$52,2,FALSE)","v":"——"},{"$f":"VLOOKUP(B5,岗位序列!$A$3:$D$52,3,FALSE)","v":"——"},{"$f":"VLOOKUP(B5,岗位序列!$A$3:$D$52,4,FALSE)","v":"——"}]
["填写说明：\n1.样表模板（含“岗位序列”工作表）不可修改，请按照表中示例格式填写；\n2.应聘岗位编号请在下拉列表中选择；\n3.学历一般填写“大专”、“大学”、“研究生”，学位一般填写“学士”、“硕士”、“博士”，学历学位断行；\n4.职务级别按照正处级、副处级、正科级、副科级、职员等五类统一格式填写;\n5.专业技术资格（技能等级）若无，则空白。"]

{"sheet":"岗位序列","index":1,"n_rows":52,"n_cols":4,"rows_kept":52,"merged":[[0,0,0,3]]}
["公开招聘岗位序列"]
["岗位编号","部门（中心）","处室","岗位"]
["请在下拉列表中选择应聘岗位编号","——","——","——"]
["0201","数据管理部\n（发展策划部）","数据管理处","标准及技术管理"]
["0202","安全质量\n与合规部","安全合规处","合规管理"]
["0203","安全质量\n与合规部","大数据安全处","副处长"]
["0204","安全质量\n与合规部","大数据安全处","数据安全管理"]
["0205","安全质量\n与合规部","大数据安全处","安全攻防管理"]
["0206","安全质量\n与合规部","平台资源处","资源管理"]
["0207","安全质量\n与合规部","平台资源处","系统与平台运维1"]
["0208","安全质量\n与合规部","平台资源处","网络与环境运维"]
["0209","数据分析中心","——","副主任"]
["0210","数据分析中心","电网处","产品管理"]
["0211","数据分析中心","电网处","数据分析"]
["0212","数据分析中心","电网处","算法模型工程师"]
["0213","数据分析中心","经营处","副处长"]
["0214","数据分析中心","经营处","数据分析"]
["0215","数据分析中心","经营处","算法模型工程师"]
["0216","数据分析中心","新业务处","处长"]
["0217","数据分析中心","新业务处","产品管理"]
["0218","数据分析中心","新业务处","业务分析"]
["0219","数据分析中心","共享服务处","副处长"]
["0220","数据分析中心","共享服务处","数据共享管理"]
["0221","数据分析中心","客户处","副处长"]
["0222","数据分析中心","客户处","数据分析"]
["0223","数据分析中心","客户处","算法模型工程师"]
["0224","数据分析中心","客户处","产品管理"]
["0225","技术支持中心","——","技术总监"]
["0226","技术支持中心","数据治理处","数据接入管理"]
["0227","技术支持中心","数据治理处","数据质量治理"]
["0228","技术支持中心","数据治理处","数据标准管理"]
["0229","技术支持中心","数据服务处","数据准备"]
["0230","技术支持中心","数据服务处","数据盘点"]
["0231","技术支持中心","数据服务处","数据开发"]
["0232","技术支持中心","技术处","副处长"]
["0233","技术支持中心","技术处","架构设计"]
["0234","技术支持中心","技术处","模型设计"]
["0235","技术支持中心","平台开发处","副处长"]
["0236","技术支持中心","平台开发处","平台开发"]
["0237","技术支持中心","平台开发处","基础组件开发"]
["0238","技术支持中心","平台开发处"," 用户体验设计"]
["0239","技术支持中心","实施与支持处","副处长"]
["0240","技术支持中心","实施与支持处","软件测试"]
["0241","技术支持中心","实施与支持处","实施服务"]
["0242","设计中心\n（创新中心）","——","技术总监"]
["0243","设计中心\n（创新中心）","设计处","数据模型设计师"]
["0244","设计中心\n（创新中心）","技术创新处","处长"]
["0245","设计中心\n（创新中心）","技术创新处","大数据分析师"]
["0246","设计中心\n（创新中心）","技术创新处","人工智能算法师"]
["0247","设计中心\n（创新中心）","技术创新处","区块链研究员"]
["0248","设计中心\n（创新中心）","业务创新处","副处长"]
["0249","设计中心\n（创新中心）","业务创新处","商务专责"]